{"text_format":"1","workbook":"xlsx","n_sheets":3,"sheets":["FRONT PAGE","CFR Return","Indschls 17-18"],"not_rendered":{"charts":0,"images":1,"macros":1,"external_links":53,"defined_names":1682,"comments":0,"pivot_tables":0},"unopened":[],"bounds":{"document_bytes":16777216,"sheet_cells":100000,"rows_first":2000,"rows_last":500,"rows_between":2000,"halvings":0,"cell_chars":16384,"cell_head_chars":4096},"cells_cut":0,"cells_raw":0,"read":"whole","date_system":"1900"}

{"sheet":"FRONT PAGE","index":0,"n_rows":98,"n_cols":25,"rows_kept":98,"cut":false,"hidden":false,"merged":[[8,3,9,3],[8,5,9,5]]}
[null,null,null,null,null,null,null,null,null,null,null,null,null,null,null,null,null,null,null,null,null,null,null,"Choose your school"]
[null,null,null,null,null,null,null,null,null,null,null,null,null,null,null,null,null,null,null,null,null,null,null,"Akiva",3520]
[null,null,null,null,null,null,null,null,null,null,null,null,null,null,null,null,null,null,null,null,null,null,null,"All Saints' CE School (N20)",3317]
[null,null,null,null,null,null,null,null,null,null,null,null,null,null,null,null,null,null,null,null,null,null,null,"All Saints' CE School (NW2)",3300]
[null,null,null,null,null,null,null,null,null,null,null,null,null,null,null,null,null,null,null,null,null,null,null,"Annunciation RC Infant School",3500]
[null,null,null,null,null,null,null,null,null,null,null,null,null,null,null,null,null,null,null,null,null,null,null,"Annunciation RC Junior School",3514]
[null,null,null,"2017-18 CFR RETURN",null,null,null,null,null,null,null,null,null,null,null,null,null,null,null,null,null,null,null,"Barnfield School",2002]
[null,null,null,null,null,null,null,null,null,null,null,null,null,null,null,null,null,null,null,null,null,null,null,"Beis Yaakov",2079]
[null,null,null,"Choose your school",null,{"$f":"VLOOKUP(D9,X:Y,2,0)","v":0},null,null,null,null,null,null,null,null,null,null,null,null,null,null,null,null,null,"Beit Shvidler",3524]
[null,null,null,null,null,null,null,null,null,null,null,null,null,null,null,null,null,null,null,null,null,null,null,"Bell Lane School",2003]
[null,null,null,null,null,null,null,null,null,null,null,null,null,null,null,null,null,null,null,null,null,null,null,"Blessed Dominic RC School",3511]
[null,null,null,null,null,null,null,null,null,null,null,null,null,null,null,null,null,null,null,null,null,null,null,"Brookhill Nursery",1000]
[null,null,null,null,null,null,null,null,null,null,null,null,null,null,null,null,null,null,null,null,null,null,null,"Brookland Infant School",2008]
[null,null,null,null,null,null,null,null,null,null,null,null,null,null,null,null,null,null,null,null,null,null,null,"Brookland Junior School",2007]
[null,null,null,null,null,null,null,null,null,null,null,null,null,null,null,null,null,null,null,null,null,null,null,"Brunswick Park School",2009]
[null,null,null,null,null,null,null,null,null,null,null,null,null,null,null,null,null,null,null,null,null,null,null,"Chalgrove School",2067]
[null,null,null,null,null,null,null,null,null,null,null,null,null,null,null,null,null,null,null,null,null,null,null,"Childs Hill School",2010]
[null,null,null,null,null,null,null,null,null,null,null,null,null,null,null,null,null,null,null,null,null,null,null,"Christ Church CE School",3302]
[null,null,null,null,null,null,null,null,null,null,null,null,null,null,null,null,null,null,null,null,null,null,null,"Church Hill School",2011]
[null,null,null,null,null,null,null,null,null,null,null,null,null,null,null,null,null,null,null,null,null,null,null,"Colindale School",2014]
[null,null,null,null,null,null,null,null,null,null,null,null,null,null,null,null,null,null,null,null,null,null,null,"Coppetts Wood School",2015]
[null,null,null,null,null,null,null,null,null,null,null,null,null,null,null,null,null,null,null,null,null,null,null,"Courtland School",2016]
[null,null,null,null,null,null,null,null,null,null,null,null,null,null,null,null,null,null,null,null,null,null,null,"Cromer Road School",2017]
[null,null,null,null,null,null,null,null,null,null,null,null,null,null,null,null,null,null,null,null,null,null,null,"Danegrove School",2073]
[null,null,null,null,null,null,null,null,null,null,null,null,null,null,null,null,null,null,null,null,null,null,null,"Deansbrook Infant School",2019]
[null,null,null,null,null,null,null,null,null,null,null,null,null,null,null,null,null,null,null,null,null,null,null,"Dollis Infant School",2021]
[null,null,null,"Contacts;",null,null,null,null,null,null,null,null,null,null,null,null,null,null,null,null,null,null,null,"Dollis Junior School",5200]
[null,null,null,"Claudette James 0208 359 7132",null,null,null,null,null,null,null,null,null,null,null,null,null,null,null,null,null,null,null,"Edgware Primary",2023]
[null,null,null,"Nicole Gibson      0208 359 7223 Tues/Weds/Thurs",null,null,null,null,null,null,null,null,null,null,null,null,null,null,null,null,null,null,null,"Fairway School",2024]
[null,null,null,null,null,null,null,null,null,null,null,null,null,null,null,null,null,null,null,null,null,null,null,"Finchley Catholic High School",5405]
[null,null,null,null,null,null,null,null,null,null,null,null,null,null,null,null,null,null,null,null,null,null,null,"Foulds School",2025]
[null,null,null,null,null,null,null,null,null,null,null,null,null,null,null,null,null,null,null,null,null,null,null,"Friern Barnet School",4003]
[null,null,null,null,null,null,null,null,null,null,null,null,null,null,null,null,null,null,null,null,null,null,null,"Frith Manor School",2026]
[null,null,null,null,null,null,null,null,null,null,null,null,null,null,null,null,null,null,null,null,null,null,null,"Garden Suburb Infant School",2028]
[null,null,null,null,null,null,null,null,null,null,null,null,null,null,null,null,null,null,null,null,null,null,null,"Garden Suburb Junior School",2027]
[null,null,null,null,null,null,null,null,null,null,null,null,null,null,null,null,null,null,null,null,null,null,null,"Goldbeaters School",2029]
[null,null,null,null,null,null,null,null,null,null,null,null,null,null,null,null,null,null,null,null,null,null,null,"Hampden Way Nursery",1001]
[null,null,null,null,null,null,null,null,null,null,null,null,null,null,null,null,null,null,null,null,null,null,null,"Hasmonean Primary School",3516]
[null,null,null,null,null,null,null,null,null,null,null,null,null,null,null,null,null,null,null,null,null,null,null,"Hollickwood School",2031]
[null,null,null,null,null,null,null,null,null,null,null,null,null,null,null,null,null,null,null,null,null,null,null,"Holly Park School",2032]
{"$rows_left_out":59}
{"sheet":"CFR Return","index":1,"n_rows":174,"n_cols":5,"rows_kept":174,"cut":false,"hidden":false,"merged":[[41,1,41,2],[56,0,57,2],[34,1,34,2],[35,1,35,2],[36,1,36,2],[37,1,37,2],[38,1,38,2],[39,1,39,2],[33,1,33,2],[5,0,5,2],[27,1,27,2],[28,1,28,2],[29,1,29,2],[32,1,32,2]]}
[]
[]
[null,"School DfE No.",{"$f":"'FRONT PAGE'!$F$9","v":0}," ",{"$f":"'FRONT PAGE'!$F$9","v":0}]
[]
[]
["CFR Return - Division of Total Revenue and Capital Balances as at 31 March 2018"]
[]
[null,"School","Cost Centre"]
[null,{"$f":"VLOOKUP($C$3,$A$71:$C$174,2,0)","v":{"$error":"#N/A"}},{"$f":"VLOOKUP($C$3,$A$71:$C$174,3,0)","v":{"$error":"#N/A"}}]
[]
["CFR Heading","Description","Balance as at 31.03.18"]
[null,null,"£"]
["B01","Committed Revenue Balance"]
["B02","Uncommitted Revenue Balance"]
["B06","Community Focussed Extended Schl Bal"]
[null,"Total Revenue Balance",{"$f":"VLOOKUP($C$9,'Indschls 17-18'!$B$5:$O$116,3,0)","v":{"$error":"#N/A"}}]
[]
["B03","Devolved Formula Capital Balance"]
["B05","Other Capital Balances"]
[]
[null,"Total Capital Balance",{"$f":"VLOOKUP($C$9,'Indschls 17-18'!$B$5:$O$116,8,0)","v":{"$error":"#N/A"}}]
[]
[]
["Please enter figures to show the breakdown of your total revenue and total"]
["capital balance as at 31 March 2018"]
[]
[]
["B01","Committed Revenue Balances - This includes: "]
[null,"Committed cumulative balance of income, less expenditure from revenue funding sources during the financial year and any committed revenue balances from previous years - this includes revenue funding received during previous financial years from specific grants "]
[null,"Any unspent voluntary income"]
[null,"Any unspent and committed pupil-focused extended school funding and/or grants"]
[null,"Unspent amount of current financial year's Pupil Premium grant"]
["B02","Uncommitted Revenue Balance - Any revenue balances including "]
[null,"the previous years not committed - Not including  any balances from "]
[null,"B01 or B06"]
["B06","Community Focussed Sch Balance - Any unspent "]
[null,"community focussed school balances (I16 & I17 less E31 &"]
[null,"E32)"]
["B03","Devolved Formula Capital Balance - Any Devolved"]
[null,"Formula Capital funding not spent"]
{"$rows_left_out":135}
{"sheet":"Indschls 17-18","index":2,"n_rows":132,"n_cols":15,"rows_kept":132,"cut":false,"hidden":false,"merged":[[0,2,0,14],[2,4,2,6],[2,9,2,10],[2,13,2,14]]}
[null,null,"Final Individual School Outturn Balances 2017-18"]
[null,1,2,3,4,5,6,7,8,9,10,11,12,13,14]
[null,null,null,"Rev","Revenue",null,null,null,"Cap","Capital",null,null,null,"Total Balance"]
[null,null,"School","As at 31.03.18","As at 31.03.17","Balance as % Final Budget Share 14-15","Increase / (decrease)",null,"As at 31.03.18",{"$f":"E4","v":"As at 31.03.17"},"Increase / (decrease)",null,"As at 31.03.18",{"$f":"E4","v":"As at 31.03.17"},"Increase / (decrease)"]
[1000,10130,"Brookhill",{"$f":"[50]Brk!$H$66","v":156379.92000000001},{"$f":"VLOOKUP(B5,[51]EOY!$A$3:$F$99,4,0)","v":158461.67000000001},0,{"$f":"D5-E5","v":-2081.75},null,{"$f":"[50]Brk!$H$76","v":4720.55},{"$f":"VLOOKUP(B5,[51]EOY!$A$3:$F$99,6,0)","v":1.25},{"$f":"I5-J5","v":4719.3},null,{"$f":"D5+I5","v":161100.47},{"$f":"E5+J5","v":158462.92000000001},{"$f":"M5-N5","v":2637.5499999999884}]
[1001,10131,"Hampden Way",{"$f":"[50]Hmp!$H$70","v":168833.62},{"$f":"VLOOKUP(B6,[51]EOY!$A$3:$F$99,4,0)","v":125592.15},0,{"$f":"D6-E6","v":43241.47},null,{"$f":"[50]Hmp!$H$81","v":3841.38},{"$f":"VLOOKUP(B6,[51]EOY!$A$3:$F$99,6,0)","v":8014.7},{"$f":"I6-J6","v":-4173.32},null,{"$f":"D6+I6","v":172675},{"$f":"E6+J6","v":133606.85},{"$f":"M6-N6","v":39068.149999999994}]
[1002,10132,"Moss Hall",{"$f":"[50]MHN!$H$70","v":304596.52},{"$f":"VLOOKUP(B7,[51]EOY!$A$3:$F$99,4,0)","v":302766.64},0,{"$f":"D7-E7","v":1829.8800000000047},null,{"$f":"[50]MHN!$H$81","v":9136.26},{"$f":"VLOOKUP(B7,[51]EOY!$A$3:$F$99,6,0)","v":10046},{"$f":"I7-J7","v":-909.73999999999978},null,313732.78000000003,{"$f":"E7+J7","v":312812.64},{"$f":"M7-N7","v":920.14000000001397}]
[1003,10133,"St Margarets",{"$f":"[50]StM!$H$67","v":14131.35},{"$f":"VLOOKUP(B8,[51]EOY!$A$3:$F$99,4,0)","v":29080.69000000001},0,{"$f":"D8-E8","v":-14949.340000000009},null,{"$f":"[50]StM!$H$79","v":5855.55},{"$f":"VLOOKUP(B8,[51]EOY!$A$3:$F$99,6,0)","v":1054.8499999999999},{"$f":"I8-J8","v":4800.7000000000007},null,19986.900000000001,{"$f":"E8+J8","v":30135.540000000008},{"$f":"M8-N8","v":-10148.640000000007}]
[]
[null,null,"Sub Total - Nursery Sector",{"$f":"SUM(D5:D8)","v":643941.41},{"$f":"SUM(E5:E8)","v":615901.15},{"$f":"SUM(F5:F8)","v":0},{"$f":"SUM(G5:G8)","v":28040.259999999995},null,{"$f":"SUM(I5:I8)","v":23553.74},{"$f":"SUM(J5:J8)","v":19116.8},4436.9400000000014,0,667495.15,635017.95000000007,32477.19999999999]
[]
[3520,11094,"Akiva",{"$f":"[50]Akv!$H$72","v":37544.599999999984},{"$f":"VLOOKUP(B12,[51]EOY!$A$3:$F$99,4,0)","v":-34411.530000000035},0,{"$f":"D12-E12","v":71956.130000000019},null,0,{"$f":"VLOOKUP(B12,[51]EOY!$A$3:$F$99,6,0)","v":9.3132257461547854E-12},{"$f":"I12-J12","v":-9.3132257461547854E-12},null,{"$f":"D12+I12","v":37544.599999999984},-34411.530000000028,{"$f":"M12-N12","v":71956.13}]
[3317,10042,"All Saints' CE School (N20)",{"$f":"[50]AstN20!$H$72","v":123256.73},{"$f":"VLOOKUP(B13,[51]EOY!$A$3:$F$99,4,0)","v":151873.35},0,-28616.62000000001,null,{"$f":"[50]AstN20!$H$83","v":0},{"$f":"VLOOKUP(B13,[51]EOY!$A$3:$F$99,6,0)","v":0},0,null,123256.73,151873.35,-28616.62000000001]
[3300,10040,"All Saints' CE School (NW2)",{"$f":"[50]AstNW2!$H$71","v":106584.36},{"$f":"VLOOKUP(B14,[51]EOY!$A$3:$F$99,4,0)","v":205150.3},0,-98565.939999999988,null,{"$f":"[50]AstNW2!$H$81","v":0},{"$f":"VLOOKUP(B14,[51]EOY!$A$3:$F$99,6,0)","v":0},0,null,106584.36,205150.3,-98565.939999999988]
[3500,10043,"Annunciation RC Infant School",{"$f":"[50]AnnI!$H$65","v":175894.23},{"$f":"VLOOKUP(B15,[51]EOY!$A$3:$F$99,4,0)","v":122676.40000000004},0,53217.829999999973,null,0,{"$f":"VLOOKUP(B15,[51]EOY!$A$3:$F$99,6,0)","v":0},0,null,175894.23,122676.40000000004,53217.829999999973]
[3514,10117,"Annunciation RC Junior School",{"$f":"[50]AnnJ!$H$70","v":103114.32},{"$f":"VLOOKUP(B16,[51]EOY!$A$3:$F$99,4,0)","v":60712.28},0,42402.040000000008,null,0,{"$f":"VLOOKUP(B16,[51]EOY!$A$3:$F$99,6,0)","v":0},0,null,103114.32,60712.28,42402.040000000008]
[2002,10044,"Barnfield School",{"$f":"[50]Barnf!$H$75","v":411190.28000000014},{"$f":"VLOOKUP(B17,[51]EOY!$A$3:$F$99,4,0)","v":375651.24},0,35539.040000000154,null,{"$f":"[50]Barnf!$H$87","v":-1.0900000000000001},{"$f":"VLOOKUP(B17,[51]EOY!$A$3:$F$99,6,0)","v":-1.07},-2.0000000000000018E-2,null,411189.19000000012,375650.17,35539.020000000135]
[2079,10128,"Beis Yaakov",{"$f":"[50]BYaak!$H$70","v":55568.340000000018},{"$f":"VLOOKUP(B18,[51]EOY!$A$3:$F$99,4,0)","v":15010.959999999995},0,40557.380000000019,null,0,{"$f":"VLOOKUP(B18,[51]EOY!$A$3:$F$99,6,0)","v":0},0,null,55568.340000000018,15010.959999999995,40557.380000000019]
[3524,11278,"Beit Shvidler Jewish Primary",{"$f":"[50]BeitShv!$H$69","v":72683.38},{"$f":"VLOOKUP(B19,[51]EOY!$A$3:$F$99,4,0)","v":58611.57},0,14071.810000000005,null,0,0,0,null,72683.38,58611.57,14071.810000000005]
[2003,10045,"Bell Lane School",{"$f":"[50]Bell!$H$76","v":100729.36999999997},{"$f":"VLOOKUP(B20,[51]EOY!$A$3:$F$99,4,0)","v":80741.78},0,19987.589999999967,null,{"$f":"[50]Bell!$H$89","v":979.74000000000228},{"$f":"VLOOKUP(B20,[51]EOY!$A$3:$F$99,6,0)","v":8826.48},-7846.7399999999971,null,101709.10999999997,89568.26,12140.849999999977]
[3511,10115,"Blessed Dominic RC School",{"$f":"[50]BDom!$H$72","v":214487.75},{"$f":"VLOOKUP(B21,[51]EOY!$A$3:$F$99,4,0)","v":74706.869999999981},0,139780.88,null,{"$f":"[50]BDom!$H$78","v":1},{"$f":"VLOOKUP(B21,[51]EOY!$A$3:$F$99,6,0)","v":1},0,null,214488.75,74707.869999999981,139780.88]
[2008,10047,"Brookland Infant School",{"$f":"[50]BrookI!$H$71","v":118776.9},{"$f":"VLOOKUP(B22,[51]EOY!$A$3:$F$99,4,0)","v":49818.019999999924},0,68958.880000000063,null,{"$f":"[50]BrookI!$H$81","v":9148},{"$f":"VLOOKUP(B22,[51]EOY!$A$3:$F$99,6,0)","v":1423.94},7724.0599999999995,null,127924.9,51241.959999999926,76682.940000000061]
[2007,10046,"Brookland Junior School",{"$f":"[50]BrookJ!$H$73","v":154040.26999999999},{"$f":"VLOOKUP(B23,[51]EOY!$A$3:$F$99,4,0)","v":181476.19},0,-27435.920000000013,null,{"$f":"[50]BrookJ!$H$84","v":-4.9999999998835844E-2},{"$f":"VLOOKUP(B23,[51]EOY!$A$3:$F$99,6,0)","v":912},-912.04999999999882,null,154040.22,182388.19,-28347.97]
[2009,10048,"Brunswick Park School",{"$f":"[50]BrunsP!$H$72","v":265273.83},{"$f":"VLOOKUP(B24,[51]EOY!$A$3:$F$99,4,0)","v":119745.33},0,145528.5,null,{"$f":"[50]BrunsP!$H$85","v":1546.3},{"$f":"VLOOKUP(B24,[51]EOY!$A$3:$F$99,6,0)","v":0},1546.3,null,266820.13,119745.33,147074.79999999999]
[2067,10118,"Chalgrove School",{"$f":"[50]Chal!$H$72","v":113348.11000000007},{"$f":"VLOOKUP(B25,[51]EOY!$A$3:$F$99,4,0)","v":126744.1},0,-13395.989999999932,null,{"$f":"[50]Chal!$H$83","v":6956.75},{"$f":"VLOOKUP(B25,[51]EOY!$A$3:$F$99,6,0)","v":-1.5},6958.25,null,120304.86000000007,126742.6,-6437.7399999999325]
[2010,10049,"Childs Hill School",{"$f":"[50]ChildsH!$H$73","v":6740.5399999999818},{"$f":"VLOOKUP(B26,[51]EOY!$A$3:$F$99,4,0)","v":39642.400000000001},0,-32901.860000000022,null,{"$f":"[50]ChildsH!$H$84","v":0},{"$f":"VLOOKUP(B26,[51]EOY!$A$3:$F$99,6,0)","v":0},0,null,6740.5399999999818,39642.400000000001,-32901.860000000022]
[3302,10050,"Christ Church CE School",{"$f":"[50]ChristC!$H$69","v":262448.06},{"$f":"VLOOKUP(B27,[51]EOY!$A$3:$F$99,4,0)","v":175744.10000000006},0,86703.959999999934,null,null,{"$f":"VLOOKUP(B27,[51]EOY!$A$3:$F$99,6,0)","v":0},0,null,262448.06,175744.10000000006,86703.959999999934]
[2011,10051,"Church Hill School",{"$f":"[50]ChurchH!$H$70","v":71783.81},{"$f":"VLOOKUP(B28,[51]EOY!$A$3:$F$99,4,0)","v":89142.43},0,-17358.619999999995,null,{"$f":"[50]ChurchH!$H$81","v":-0.25},{"$f":"VLOOKUP(B28,[51]EOY!$A$3:$F$99,6,0)","v":161.5},-161.75,null,71783.56,89303.93,-17520.369999999995]
[3522,10953,"Claremont Primary",null,0,0,0,null,null,0,0,null,0,0,0]
[2014,10054,"Colindale School",{"$f":"[50]Colin!$H$72","v":500697.81999999995},{"$f":"VLOOKUP(B30,[51]EOY!$A$3:$F$99,4,0)","v":691029.48},0,-190331.66000000003,null,{"$f":"[50]Colin!$H$85","v":0},{"$f":"VLOOKUP(B30,[51]EOY!$A$3:$F$99,6,0)","v":0},0,null,500697.81999999995,691029.48,-190331.66000000003]
[2015,10055,"Coppetts Wood School",{"$f":"[50]Coppet!$H$76","v":445664.48},{"$f":"VLOOKUP(B31,[51]EOY!$A$3:$F$99,4,0)","v":416463.80000000005},0,29200.679999999935,null,{"$f":"[50]Coppet!$H$87","v":14118},{"$f":"VLOOKUP(B31,[51]EOY!$A$3:$F$99,6,0)","v":7066.75},7051.25,null,459782.48,423530.55000000005,36251.929999999935]
[2016,10056,"Courtland School",{"$f":"[50]Court!$H$74","v":92609.3},{"$f":"VLOOKUP(B32,[51]EOY!$A$3:$F$99,4,0)","v":12493.329999999994},0,80115.97,null,{"$f":"[50]Court!$H$86","v":0.66},{"$f":"VLOOKUP(B32,[51]EOY!$A$3:$F$99,6,0)","v":11092.19},-11091.53,null,92609.96,23585.519999999997,69024.44]
[2017,10057,"Cromer Road School",{"$f":"[50]Cromer!$H$71","v":173552.5},{"$f":"VLOOKUP(B33,[51]EOY!$A$3:$F$99,4,0)","v":137978.37},0,35574.130000000005,null,{"$f":"[50]Cromer!$H$82","v":14872.5},{"$f":"VLOOKUP(B33,[51]EOY!$A$3:$F$99,6,0)","v":14715.2},157.29999999999927,null,188425,152693.57,35731.429999999993]
[2073,10083,"Danegrove School",{"$f":"[50]Daneg!$H$72","v":351920.21},{"$f":"VLOOKUP(B34,[51]EOY!$A$3:$F$99,4,0)","v":461078.79},0,-109158.57999999996,null,{"$f":"[50]Daneg!$H$82","v":647.25},{"$f":"VLOOKUP(B34,[51]EOY!$A$3:$F$99,6,0)","v":-0.25},647.5,null,352567.46,461078.54,-108511.07999999996]
[2019,10059,"Deansbrook Infant School",{"$f":"[50]DeansI!$H$70","v":116843.47999999992},{"$f":"VLOOKUP(B35,[51]EOY!$A$3:$F$99,4,0)","v":36222.559999999925},0,80620.92,null,{"$f":"[50]DeansI!$H$81","v":13770},{"$f":"VLOOKUP(B35,[51]EOY!$A$3:$F$99,6,0)","v":15618.25},-1848.25,null,130613.47999999992,51840.809999999925,78772.67]
[2021,10061,"Dollis Infant School",{"$f":"[50]DollisI!$H$72","v":184963.85},{"$f":"VLOOKUP(B36,[51]EOY!$A$3:$F$99,4,0)","v":84238.55},0,100725.3,null,{"$f":"[50]DollisI!$H$82","v":14581.349999999999},{"$f":"VLOOKUP(B36,[51]EOY!$A$3:$F$99,6,0)","v":16523.97},-1942.6200000000026,null,199545.2,100762.52,98782.680000000008]
[5200,10060,"Dollis Junior School",{"$f":"[50]DollisJ!$H$70","v":61398.239999999983},{"$f":"VLOOKUP(B37,[51]EOY!$A$3:$F$99,4,0)","v":32911.349999999991},0,28486.889999999992,null,{"$f":"[50]DollisJ!$H$81","v":6403.5},{"$f":"VLOOKUP(B37,[51]EOY!$A$3:$F$99,6,0)","v":5264},1139.5,null,67801.739999999991,38175.349999999991,29626.39]
[2023,10063,"Edgware Primary",{"$f":"[50]EdgwP!$H$72","v":56561.459999999992},{"$f":"VLOOKUP(B38,[51]EOY!$A$3:$F$99,4,0)","v":16604.280000000042},0,39957.179999999949,null,{"$f":"[50]EdgwP!$H$85","v":0.3700000000023283},{"$f":"VLOOKUP(B38,[51]EOY!$A$3:$F$99,6,0)","v":641.6},-641.22999999999774,null,56561.829999999994,17245.880000000041,39315.949999999953]
[2024,10064,"Fairway School",{"$f":"[50]Fair!$H$75","v":167149.75000000009},{"$f":"VLOOKUP(B39,[51]EOY!$A$3:$F$99,4,0)","v":170460.72000000015},0,-3310.9700000000594,null,{"$f":"[50]Fair!$H$86","v":21468.89},{"$f":"VLOOKUP(B39,[51]EOY!$A$3:$F$99,6,0)","v":39959.07},-18490.18,null,188618.64000000007,210419.79000000015,-21801.150000000081]
[2025,10065,"Foulds School",{"$f":"[50]Fould!$H$72","v":171440.37},{"$f":"VLOOKUP(B40,[51]EOY!$A$3:$F$99,4,0)","v":96651.58},0,74788.789999999994,null,{"$f":"[50]Fould!$H$85","v":10533.75},{"$f":"VLOOKUP(B40,[51]EOY!$A$3:$F$99,6,0)","v":9042.85},1490.8999999999996,null,181974.12,105694.43000000001,76279.689999999988]
{"$rows_left_out":92}